Click here to Skip to main content
15,299,443 members
Home / Discussions / ASP.NET
   

ASP.NET

 
QuestionIndividual Accounts in webapi project vs2017 Pin
ganesh.dks28-Jul-20 21:44
Memberganesh.dks28-Jul-20 21:44 
QuestionUsing Authorize(Roles) in my API controller Pin
jkirkerx20-Jul-20 6:36
professionaljkirkerx20-Jul-20 6:36 
AnswerRe: Using Authorize(Roles) in my API controller Pin
jkirkerx21-Jul-20 6:01
professionaljkirkerx21-Jul-20 6:01 
AnswerWell after another failed day to figure it out ... Pin
jkirkerx21-Jul-20 12:53
professionaljkirkerx21-Jul-20 12:53 
AnswerThink I figured it out Pin
jkirkerx22-Jul-20 12:51
professionaljkirkerx22-Jul-20 12:51 
AnswerHead scratcher here Pin
jkirkerx23-Jul-20 10:33
professionaljkirkerx23-Jul-20 10:33 
AnswerDid the rewrite on both the server and client side, works great now Pin
jkirkerx27-Jul-20 7:48
professionaljkirkerx27-Jul-20 7:48 
QuestionUpgrading from .Net Core 2.2 to 3.1, SSL and Docker .net core images Pin
jkirkerx17-Jul-20 7:20
professionaljkirkerx17-Jul-20 7:20 
Was forced to upgrade yesterday. Went to publish a Docker Container and the 2.2 images were no longer available.
So I made it through the code changes; well at least I think I did, but can't run my web app because of the SSL error.

I get the SSL connection not trusted error on both Firefox and Chrome. No option to ignore and accept the risk. Says my certificate is totally unsafe.

Changed the project file to 3.1, upgraded NuGet packages.
I tried IIS Crypto and set back to preferred.
Did the Dotnet https clean and trust
Installed Win64 OpenSSL to look at my localhost.pfx but can't really figure out how to use the program.
I realize now that my startup.cs only loads Kestrel for running in a Docker container so my pfx files are not the issue.
Ruled out HTTP1 or HTTP2

Issue two, finding the right Docker image to use in the container.
I was using ...
FROM microsoft/dotnet:2.2-aspnetcore-runtime AS base
FROM microsoft/dotnet:2.2-sdk AS build
Tried just changing the version number to 3.1, didn't work.

Yesterday just from about 15mins of research, I changed to
FROM mcr.microsoft.com/dotnet/core/aspnet:3.1 AS base
FROM mcr.microsoft.com/dotnet/core/sdk:3.1 AS build

But the build bombs; Can't remember why, I'll build it again.
Fallback package Xamarin, That gives me something to go on ...

1>/usr/share/dotnet/sdk/3.1.302/Sdks/Microsoft.NET.Sdk/targets/Microsoft.PackageDependencyResolution.targets(234,5): error MSB4018: The "ResolvePackageAssets" task failed unexpectedly. [/src/jkirkerx/jkirkerx.csproj]
1>/usr/share/dotnet/sdk/3.1.302/Sdks/Microsoft.NET.Sdk/targets/Microsoft.PackageDependencyResolution.targets(234,5): error MSB4018: NuGet.Packaging.Core.PackagingException: Unable to find fallback package folder 'C:\Microsoft\Xamarin\NuGet\'. [/src/jkirkerx/jkirkerx.csproj]
1>/usr/share/dotnet/sdk/3.1.302/Sdks/Microsoft.NET.Sdk/targets/Microsoft.PackageDependencyResolution.targets(234,5): error MSB4018: at NuGet.Packaging.FallbackPackagePathResolver..ctor(String userPackageFolder, IEnumerable
1 fallbackPackageFolders) [/src/jkirkerx/jkirkerx.csproj]<br />
1>/usr/share/dotnet/sdk/3.1.302/Sdks/Microsoft.NET.Sdk/targets/Microsoft.PackageDependencyResolution.targets(234,5): error MSB4018:    at Microsoft.NET.Build.Tasks.NuGetPackageResolver.CreateResolver(IEnumerable
1 packageFolders) [/src/jkirkerx/jkirkerx.csproj]
1>/usr/share/dotnet/sdk/3.1.302/Sdks/Microsoft.NET.Sdk/targets/Microsoft.PackageDependencyResolution.targets(234,5): error MSB4018: at Microsoft.NET.Build.Tasks.NuGetPackageResolver.CreateResolver(LockFile lockFile) [/src/jkirkerx/jkirkerx.csproj]
1>/usr/share/dotnet/sdk/3.1.302/Sdks/Microsoft.NET.Sdk/targets/Microsoft.PackageDependencyResolution.targets(234,5): error MSB4018: at Microsoft.NET.Build.Tasks.ResolvePackageAssets.CacheWriter..ctor(ResolvePackageAssets task) [/src/jkirkerx/jkirkerx.csproj]
1>/usr/share/dotnet/sdk/3.1.302/Sdks/Microsoft.NET.Sdk/targets/Microsoft.PackageDependencyResolution.targets(234,5): error MSB4018: at Microsoft.NET.Build.Tasks.ResolvePackageAssets.CacheReader.CreateReaderFromDisk(ResolvePackageAssets task, Byte[] settingsHash) [/src/jkirkerx/jkirkerx.csproj]
1>/usr/share/dotnet/sdk/3.1.302/Sdks/Microsoft.NET.Sdk/targets/Microsoft.PackageDependencyResolution.targets(234,5): error MSB4018: at Microsoft.NET.Build.Tasks.ResolvePackageAssets.CacheReader..ctor(ResolvePackageAssets task) [/src/jkirkerx/jkirkerx.csproj]
1>/usr/share/dotnet/sdk/3.1.302/Sdks/Microsoft.NET.Sdk/targets/Microsoft.PackageDependencyResolution.targets(234,5): error MSB4018: at Microsoft.NET.Build.Tasks.ResolvePackageAssets.ReadItemGroups() [/src/jkirkerx/jkirkerx.csproj]
1>/usr/share/dotnet/sdk/3.1.302/Sdks/Microsoft.NET.Sdk/targets/Microsoft.PackageDependencyResolution.targets(234,5): error MSB4018: at Microsoft.NET.Build.Tasks.ResolvePackageAssets.ExecuteCore() [/src/jkirkerx/jkirkerx.csproj]
1>/usr/share/dotnet/sdk/3.1.302/Sdks/Microsoft.NET.Sdk/targets/Microsoft.PackageDependencyResolution.targets(234,5): error MSB4018: at Microsoft.NET.Build.Tasks.TaskBase.Execute() [/src/jkirkerx/jkirkerx.csproj]
1>/usr/share/dotnet/sdk/3.1.302/Sdks/Microsoft.NET.Sdk/targets/Microsoft.PackageDependencyResolution.targets(234,5): error MSB4018: at Microsoft.Build.BackEnd.TaskExecutionHost.Microsoft.Build.BackEnd.ITaskExecutionHost.Execute() [/src/jkirkerx/jkirkerx.csproj]
1>/usr/share/dotnet/sdk/3.1.302/Sdks/Microsoft.NET.Sdk/targets/Microsoft.PackageDependencyResolution.targets(234,5): error MSB4018: at Microsoft.Build.BackEnd.TaskBuilder.ExecuteInstantiatedTask(ITaskExecutionHost taskExecutionHost, TaskLoggingContext taskLoggingContext, TaskHost taskHost, ItemBucket bucket, TaskExecutionMode howToExecuteTask) [/src/jkirkerx/jkirkerx.csproj]
1>Build FAILED.
1>
1>/usr/share/dotnet/sdk/3.1.302/Sdks/Microsoft.NET.Sdk/targets/Microsoft.PackageDependencyResolution.targets(234,5): error MSB4018: The "ResolvePackageAssets" task failed unexpectedly. [/src/jkirkerx/jkirkerx.csproj]
1>/usr/share/dotnet/sdk/3.1.302/Sdks/Microsoft.NET.Sdk/targets/Microsoft.PackageDependencyResolution.targets(234,5): error MSB4018: NuGet.Packaging.Core.PackagingException: Unable to find fallback package folder 'C:\Microsoft\Xamarin\NuGet\'. [/src/jkirkerx/jkirkerx.csproj]
1>/usr/share/dotnet/sdk/3.1.302/Sdks/Microsoft.NET.Sdk/targets/Microsoft.PackageDependencyResolution.targets(234,5): error MSB4018: at NuGet.Packaging.FallbackPackagePathResolver..ctor(String userPackageFolder, IEnumerable
1 fallbackPackageFolders) [/src/jkirkerx/jkirkerx.csproj]<br />
1>/usr/share/dotnet/sdk/3.1.302/Sdks/Microsoft.NET.Sdk/targets/Microsoft.PackageDependencyResolution.targets(234,5): error MSB4018:    at Microsoft.NET.Build.Tasks.NuGetPackageResolver.CreateResolver(IEnumerable
1 packageFolders) [/src/jkirkerx/jkirkerx.csproj]
1>/usr/share/dotnet/sdk/3.1.302/Sdks/Microsoft.NET.Sdk/targets/Microsoft.PackageDependencyResolution.targets(234,5): error MSB4018: at Microsoft.NET.Build.Tasks.NuGetPackageResolver.CreateResolver(LockFile lockFile) [/src/jkirkerx/jkirkerx.csproj]
1>/usr/share/dotnet/sdk/3.1.302/Sdks/Microsoft.NET.Sdk/targets/Microsoft.PackageDependencyResolution.targets(234,5): error MSB4018: at Microsoft.NET.Build.Tasks.ResolvePackageAssets.CacheWriter..ctor(ResolvePackageAssets task) [/src/jkirkerx/jkirkerx.csproj]
1>/usr/share/dotnet/sdk/3.1.302/Sdks/Microsoft.NET.Sdk/targets/Microsoft.PackageDependencyResolution.targets(234,5): error MSB4018: at Microsoft.NET.Build.Tasks.ResolvePackageAssets.CacheReader.CreateReaderFromDisk(ResolvePackageAssets task, Byte[] settingsHash) [/src/jkirkerx/jkirkerx.csproj]
1>/usr/share/dotnet/sdk/3.1.302/Sdks/Microsoft.NET.Sdk/targets/Microsoft.PackageDependencyResolution.targets(234,5): error MSB4018: at Microsoft.NET.Build.Tasks.ResolvePackageAssets.CacheReader..ctor(ResolvePackageAssets task) [/src/jkirkerx/jkirkerx.csproj]
1>/usr/share/dotnet/sdk/3.1.302/Sdks/Microsoft.NET.Sdk/targets/Microsoft.PackageDependencyResolution.targets(234,5): error MSB4018: at Microsoft.NET.Build.Tasks.ResolvePackageAssets.ReadItemGroups() [/src/jkirkerx/jkirkerx.csproj]
1>/usr/share/dotnet/sdk/3.1.302/Sdks/Microsoft.NET.Sdk/targets/Microsoft.PackageDependencyResolution.targets(234,5): error MSB4018: at Microsoft.NET.Build.Tasks.ResolvePackageAssets.ExecuteCore() [/src/jkirkerx/jkirkerx.csproj]
1>/usr/share/dotnet/sdk/3.1.302/Sdks/Microsoft.NET.Sdk/targets/Microsoft.PackageDependencyResolution.targets(234,5): error MSB4018: at Microsoft.NET.Build.Tasks.TaskBase.Execute() [/src/jkirkerx/jkirkerx.csproj]
1>/usr/share/dotnet/sdk/3.1.302/Sdks/Microsoft.NET.Sdk/targets/Microsoft.PackageDependencyResolution.targets(234,5): error MSB4018: at Microsoft.Build.BackEnd.TaskExecutionHost.Microsoft.Build.BackEnd.ITaskExecutionHost.Execute() [/src/jkirkerx/jkirkerx.csproj]
1>/usr/share/dotnet/sdk/3.1.302/Sdks/Microsoft.NET.Sdk/targets/Microsoft.PackageDependencyResolution.targets(234,5): error MSB4018: at Microsoft.Build.BackEnd.TaskBuilder.ExecuteInstantiatedTask(ITaskExecutionHost taskExecutionHost, TaskLoggingContext taskLoggingContext, TaskHost taskHost, ItemBucket bucket, TaskExecutionMode howToExecuteTask) [/src/jkirkerx/jkirkerx.csproj]
1> 0 Warning(s)
1> 1 Error(s)
1>
If it ain't broke don't fix it
Discover my world at jkirkerx.com

AnswerRe: Upgrading from .Net Core 2.2 to 3.1, SSL and Docker .net core images Pin
jkirkerx17-Jul-20 11:31
professionaljkirkerx17-Jul-20 11:31 
GeneralRe: Upgrading from .Net Core 2.2 to 3.1, SSL and Docker .net core images Pin
jkirkerx17-Jul-20 11:46
professionaljkirkerx17-Jul-20 11:46 
GeneralRe: Upgrading from .Net Core 2.2 to 3.1, SSL and Docker .net core images Pin
jkirkerx17-Jul-20 12:36
professionaljkirkerx17-Jul-20 12:36 
QuestionGenerating unique user ID Pin
Otekpo Emmanuel7-Jul-20 7:29
MemberOtekpo Emmanuel7-Jul-20 7:29 
AnswerRe: Generating unique user ID Pin
Richard Deeming7-Jul-20 7:47
mveRichard Deeming7-Jul-20 7:47 
GeneralRe: Generating unique user ID Pin
Otekpo Emmanuel8-Jul-20 3:06
MemberOtekpo Emmanuel8-Jul-20 3:06 
GeneralRe: Generating unique user ID Pin
Richard Deeming8-Jul-20 3:42
mveRichard Deeming8-Jul-20 3:42 
GeneralRe: Generating unique user ID Pin
Mycroft Holmes8-Jul-20 12:46
professionalMycroft Holmes8-Jul-20 12:46 
AnswerRe: Generating unique user ID Pin
David Mujica10-Jul-20 2:47
MemberDavid Mujica10-Jul-20 2:47 
GeneralRe: Generating unique user ID Pin
jkirkerx13-Jul-20 11:25
professionaljkirkerx13-Jul-20 11:25 
GeneralRe: Generating unique user ID Pin
DerekT-P17-Jul-20 10:44
professionalDerekT-P17-Jul-20 10:44 
Questionpls help Pin
Member 148797912-Jul-20 21:44
MemberMember 148797912-Jul-20 21:44 
SuggestionRe: pls help Pin
Richard MacCutchan2-Jul-20 21:48
mveRichard MacCutchan2-Jul-20 21:48 
GeneralRe: pls help Pin
ZurdoDev6-Jul-20 8:10
professionalZurdoDev6-Jul-20 8:10 
AnswerRe: pls help Pin
David Mujica6-Jul-20 7:27
MemberDavid Mujica6-Jul-20 7:27 
JokeRe: pls help Pin
DerekT-P7-Jul-20 2:18
professionalDerekT-P7-Jul-20 2:18 
QuestionAngular service error http 400 using .Net core api to accept json, escaped quotes crashing api Pin
jkirkerx29-Jun-20 12:48
professionaljkirkerx29-Jun-20 12:48 

General General    News News    Suggestion Suggestion    Question Question    Bug Bug    Answer Answer    Joke Joke    Praise Praise    Rant Rant    Admin Admin   

Use Ctrl+Left/Right to switch messages, Ctrl+Up/Down to switch threads, Ctrl+Shift+Left/Right to switch pages.