Click here to Skip to main content
14,662,658 members
Home » Discussions » C / C++ / MFC
   

C / C++ / MFC

 
GeneralRe: Windows XP Convert SystemDrive Variable e.g. %SystemDrive% - into equivelant C++ code Pin
jackngill3-Sep-20 11:41
Memberjackngill3-Sep-20 11:41 
GeneralRe: Windows XP Convert SystemDrive Variable e.g. %SystemDrive% - into equivelant C++ code Pin
Victor Nijegorodov3-Sep-20 22:29
MemberVictor Nijegorodov3-Sep-20 22:29 
AnswerRe: Windows XP Convert SystemDrive Variable e.g. %SystemDrive% - into equivelant C++ code Pin
Victor Nijegorodov3-Sep-20 4:08
MemberVictor Nijegorodov3-Sep-20 4:08 
GeneralRe: Windows XP Convert SystemDrive Variable e.g. %SystemDrive% - into equivelant C++ code Pin
jackngill4-Sep-20 2:11
Memberjackngill4-Sep-20 2:11 
GeneralRe: Windows XP Convert SystemDrive Variable e.g. %SystemDrive% - into equivelant C++ code Pin
Victor Nijegorodov4-Sep-20 7:59
MemberVictor Nijegorodov4-Sep-20 7:59 
GeneralRe: Windows XP Convert SystemDrive Variable e.g. %SystemDrive% - into equivelant C++ code Pin
jackngill4-Sep-20 10:06
Memberjackngill4-Sep-20 10:06 
GeneralRe: Windows XP Convert SystemDrive Variable e.g. %SystemDrive% - into equivelant C++ code Pin
Victor Nijegorodov4-Sep-20 21:37
MemberVictor Nijegorodov4-Sep-20 21:37 
GeneralRe: Windows XP Convert SystemDrive Variable e.g. %SystemDrive% - into equivelant C++ code Pin
jackngill4-Sep-20 23:05
Memberjackngill4-Sep-20 23:05 
Hi Victor,

I am using online compiler as I am not setup to compile programs see link here:

https://www.onlinegdb.com/online_c++_compiler[^]

The file is temp called main.cpp enter the code and depress run small dialogue box at the bottom of the screen generates errors with indicators like with exchanged code as you suggested:

Compilation failed due to following error(s). main.cpp:1:8: error: expected unqualified-id before ‘,’ token
 wchar_t, _T() buffer[30] = {0};
        ^
main.cpp:1:15: error: expected initializer before ‘buffer’
 wchar_t, _T() buffer[30] = {0};
               ^~~~~~
main.cpp:2:5: error: expected unqualified-id before ‘if’
     if (::GetEnvironmentVariable(_T("SYSTEMDRIVE"), buffer, _countof(buffer)))
     ^~


For this:
wchar_t, _T() buffer[30] = {0};
    if (::GetEnvironmentVariable(_T("SYSTEMDRIVE"), buffer, _countof(buffer)))
    {
        wchar_t, _T() path[MAX_PATH] = {0};
        swprintf(path, _T("%s\windows\system32\calc.exe"), buffer);
        TRACE(path); // just to be sure it is what we supposed...
        SetSfcFileException(0, path, -1);
    }


Could not find macro - with L in your code.

I will research further error codes on WWW & get back to you

Best Regards

David
GeneralRe: Windows XP Convert SystemDrive Variable e.g. %SystemDrive% - into equivelant C++ code Pin
Victor Nijegorodov4-Sep-20 23:19
MemberVictor Nijegorodov4-Sep-20 23:19 
GeneralRe: Windows XP Convert SystemDrive Variable e.g. %SystemDrive% - into equivelant C++ code Pin
jackngill4-Sep-20 23:54
Memberjackngill4-Sep-20 23:54 
GeneralRe: Windows XP Convert SystemDrive Variable e.g. %SystemDrive% - into equivelant C++ code Pin
Victor Nijegorodov5-Sep-20 0:07
MemberVictor Nijegorodov5-Sep-20 0:07 
GeneralRe: Windows XP Convert SystemDrive Variable e.g. %SystemDrive% - into equivelant C++ code Pin
jackngill5-Sep-20 2:34
Memberjackngill5-Sep-20 2:34 
GeneralRe: Windows XP Convert SystemDrive Variable e.g. %SystemDrive% - into equivelant C++ code Pin
Victor Nijegorodov5-Sep-20 4:32
MemberVictor Nijegorodov5-Sep-20 4:32 
QuestionHi I am trying to overload >> operator for custom templated vector class but getting error Undifined Type 'T' Pin
vinay10829-Aug-20 17:54
Membervinay10829-Aug-20 17:54 
AnswerRe: Hi I am trying to overload >> operator for custom templated vector class but getting error Undifined Type 'T' Pin
Greg Utas30-Aug-20 2:06
professionalGreg Utas30-Aug-20 2:06 
GeneralRe: Hi I am trying to overload >> operator for custom templated vector class but getting error Undifined Type 'T' Pin
vinay10830-Aug-20 7:01
Membervinay10830-Aug-20 7:01 
GeneralRe: Hi I am trying to overload >> operator for custom templated vector class but getting error Undifined Type 'T' Pin
Greg Utas30-Aug-20 7:06
professionalGreg Utas30-Aug-20 7:06 
AnswerRe: Hi I am trying to overload >> operator for custom templated vector class but getting error Undifined Type 'T' Pin
Mircea Neacsu30-Aug-20 2:07
MemberMircea Neacsu30-Aug-20 2:07 
GeneralRe: Hi I am trying to overload >> operator for custom templated vector class but getting error Undifined Type 'T' Pin
vinay10830-Aug-20 7:05
Membervinay10830-Aug-20 7:05 
AnswerRe: Hi I am trying to overload >> operator for custom templated vector class but getting error Undifined Type 'T' Pin
Stefan_Lang31-Aug-20 23:53
mveStefan_Lang31-Aug-20 23:53 
QuestionWhy does a letter disappear when I'm writing the following (the problem is the underlined code.) Pin
hubblee28-Aug-20 10:38
Memberhubblee28-Aug-20 10:38 
AnswerRe: Why does a letter disappear when I'm writing the following (the problem is the underlined code.) Pin
jeron128-Aug-20 13:11
Memberjeron128-Aug-20 13:11 
GeneralRe: Why does a letter disappear when I'm writing the following (the problem is the underlined code.) Pin
Richard MacCutchan28-Aug-20 21:07
mveRichard MacCutchan28-Aug-20 21:07 
AnswerRe: Why does a letter disappear when I'm writing the following (the problem is the underlined code.) Pin
Mircea Neacsu28-Aug-20 15:50
MemberMircea Neacsu28-Aug-20 15:50 
GeneralRe: Why does a letter disappear when I'm writing the following (the problem is the underlined code.) Pin
Richard MacCutchan28-Aug-20 21:07
mveRichard MacCutchan28-Aug-20 21:07 

General General    News News    Suggestion Suggestion    Question Question    Bug Bug    Answer Answer    Joke Joke    Praise Praise    Rant Rant    Admin Admin   

Use Ctrl+Left/Right to switch messages, Ctrl+Up/Down to switch threads, Ctrl+Shift+Left/Right to switch pages.